{"text_format":"1","workbook":"xlsx","n_sheets":7,"sheets":["Accueil","Strat 1","Strat 2","Strat 3","grille","PIT","grille2"],"not_rendered":{"charts":0,"images":37,"macros":1,"external_links":1,"defined_names":29,"comments":4,"pivot_tables":0},"unopened":[],"bounds":{"document_bytes":16777216,"sheet_cells":100000,"rows_first":2000,"rows_last":500,"rows_between":2000,"halvings":0,"cell_chars":16384,"cell_head_chars":4096},"cells_cut":0,"cells_raw":0,"read":"whole","date_system":"1900"}

{"sheet":"Accueil","index":0,"n_rows":19,"n_cols":11,"rows_kept":19,"cut":false,"hidden":false,"merged":[]}
[]
[]
[]
[]
[]
[]
[]
[]
[]
[null,null,"Indiquer 4 informations essentielles et élaborer jusqu’à 3 stratégies de course en quelques clics !"]
[]
[null,null,"Dans les cellules à fonds jaunes",null,null,null,null,null,null,"Dans les cellules à fonds blancs"]
[]
[null,null,"saisie","obligatoire",null,null,null,null,null,"saisie","facultative"]
[]
[null,"P","Sélectionner le circuit",null,null,null,null,null,"P","choix du véhicule"]
[null,"P","indiquer la durée de la course",null,null,null,null,null,"P","choix du type de gomme lié au temps chrono"]
[null,"P","saisir un temps chrono au tour",null,null,null,null,null,"P","Indications des conditions d'usure et conso"]
[null,"P","indiquer l'autonomie du véhicule",null,null,null,null,null,"P","indication des temps d'arrêts aux stands"]

{"sheet":"Strat 1","index":1,"n_rows":77,"n_cols":22,"rows_kept":77,"cut":false,"hidden":false,"merged":[[61,1,61,2],[61,4,61,5],[59,4,59,5],[57,6,57,7],[60,13,60,14],[59,13,59,15],[57,1,57,2],[57,8,57,9],[57,10,57,11],[59,1,59,2],[59,10,59,11],[59,8,59,9],[61,7,61,8],[61,10,61,11],[57,16,57,17],[57,13,57,14],[59,16,59,17],[22,23,22,25],[46,20,47,20],[53,16,53,19],[54,16,54,19],[36,23,37,25],[32,23,32,25],[30,23,30,25],[4,27,4,29],[4,30,4,32],[6,16,6,17],[4,16,4,17],[32,1,32,2],[30,1,30,2],[24,1,24,2],[13,17,14,17],[21,15,22,17],[21,12,22,14],[30,16,30,17],[30,30,30,31],[32,27,32,28],[32,30,32,31],[30,27,30,28],[0,0,1,1],[2,0,18,1],[2,4,2,7],[2,8,2,9],[2,13,2,15],[6,4,6,7],[6,8,6,9],[4,8,4,9],[4,14,4,15],[17,5,17,6],[15,5,15,6],[14,2,15,4],[13,14,14,14],[15,11,15,13],[15,8,15,9],[4,2,4,4],[35,1,35,2],[12,4,12,5],[39,20,39,21],[36,1,36,2],[17,8,17,9],[17,11,17,13],[22,19,23,19],[36,16,37,16],[21,1,22,6],[21,7,22,7],[28,1,28,2],[25,1,25,2],[34,1,34,2],[21,8,22,10],[19,1,19,18],[39,1,39,2]]}
[]
[]
["DONNEES COURSE",null,"Circuit / Piste :",null,null,null,null,null,"Longueur circuit :",null,{"$f":"VLOOKUP(E3,grille!K19:L102,2,FALSE)","v":{"$error":"#N/A"}},"corners :",{"$f":"VLOOKUP(E3,grille!K19:M102,3,FALSE)","v":{"$error":"#N/A"}},"Condition météo, horaire : ",null,null,null,"0h0"]
[]
[null,null,"Catégorie du  véhicule : ",null,null,null,null,null,"Durée de la course :",null,"00:00:00","hr     où",0,{"$f":"K5+K58+K7","v":"00:00:40"},"Host salon : "]
[]
[null,null,"Modèle :",null,null,null,null,null,null,null,"00:00:40",null,null,null,null,"Cast : "]
[]
[null,null,null,null,"condition usure",null,"type gomme",null,null,null,"condition conso",null,"autonomie",null,"consommation","taux/vol",null,"volume"]
[null,null,null,null,"X1",null,null,null,null,null,"X1",null,0,"soit : ",{"$f":"(1*O12)/M13*K3","v":{"$error":"#N/A"}},{"$f":"(O10*1)/O12","v":{"$error":"#N/A"}},"Jauge initiale :",100]
[null,null,null,null,null,null,"Temps / tour","nbr tours",null,null,null,null,null,null,"pour :"]
[null,null,null,null,null,null,"00:00:00",null,null,null,null,null,null,null,100]
[null,null,null,null,null,null,null,null,null,null,null,null,{"$f":"M10*K3","v":{"$error":"#N/A"}}]
[null,null,null,null,null,null,null,null,null,null,null,null,null,null,"Litre/Sec",null,null,"1 tour",null,null,{"$f":"O12/V16","v":{"$error":"#N/A"}}]
[null,null,"Temps d'arrêt au stand :",null,null,null,null,null,null,null,null,null,null,null,null,null,null,null,null,null,"L/KM"]
[null,null,null,null,null,"ENTREE / SORTIE : ",null,{"$f":"PIT!S9-PIT!S7","v":3.5},"ECHANGE PNEUS :  ",null,{"$f":"PIT!S7","v":4.5},"REFUEL vitesse de ravitaillement : ",null,null,{"$f":"PIT!S17","v":6.666666666666667},null,1,{"$f":"PIT!S13","v":{"$error":"#DIV/0!"}},null,null,{"$f":"M10","v":0},{"$f":"K3*M10","v":{"$error":"#N/A"}}]
[null,null,null,null,null,null,null,null,null,null,null,null,null,null,null,null,null,null,null,null,null,"1 plein"]
[null,null,null,null,null,"Echange pneumatiques : ",null,{"$f":"H16+K16","v":8},"Temps pneus + fuel : ",null,{"$f":"H18+(M10*R16)","v":{"$error":"#DIV/0!"}},"Nbr de tours total de refuel : ",null,null,{"$f":"U36","v":{"$error":"#N/A"}},{"$f":"O18*R16","v":{"$error":"#N/A"}}]
[]
[]
[]
[null,"Tableau de bord stratégie de course ",null,null,null,null,null,1,"saisir un temps au tour\ndans données course",null,null,null,null,null,null,"Vous dépassez la durée de\ncourse de plus d'un tour"]
[null,null,null,null,null,null,null,null,null,null,null,null,null,null,null,null,null,null,null,"total nbr de tours"]
[]
[null,"Nbr de tours / pit",null,null,"Départ",null,"Pit 1",null,"Pit 2",null,"Pit 3",null,"Pit 4",null,"Pit 5",null,null,null,null,{"$f":"R25+P25+N25+L25+J25+H25+F25","v":0}]
[null,"Pertes de temps total : purge pénalité..."]
[null,null,"00:00:00",null,null,{"$f":"F25*$K$3","v":{"$error":"#N/A"}},null,{"$f":"H25*$K$3","v":{"$error":"#N/A"}},null,{"$f":"J25*$K$3","v":{"$error":"#N/A"}},null,{"$f":"L25*$K$3","v":{"$error":"#N/A"}},null,{"$f":"N25*$K$3","v":{"$error":"#N/A"}},null,{"$f":"P25*$K$3","v":{"$error":"#N/A"}}]
[]
[null,"Tours & Temps",null,null,null,{"$f":"F25","v":0},{"$f":"F25*E62","v":{"$error":"#N/A"}},{"$f":"F29+H25","v":0},{"$f":"(E62*H25)+G29","v":{"$error":"#N/A"}},{"$f":"H29+J25","v":0},{"$f":"(J25*E62)+I29","v":{"$error":"#N/A"}},{"$f":"J29+L25","v":0},{"$f":"L25*E62+K29","v":{"$error":"#N/A"}},{"$f":"L29+N25","v":0},{"$f":"(N25*E62)+M29","v":{"$error":"#N/A"}},{"$f":"N29+P25","v":0},{"$f":"(P25*E62)+O29","v":{"$error":"#N/A"}},{"$f":"P29+R25","v":0}]
[]
{"$rows_left_out":48}
{"sheet":"Strat 2","index":2,"n_rows":77,"n_cols":22,"rows_kept":77,"cut":false,"hidden":false,"merged":[[60,13,60,14],[61,1,61,2],[61,4,61,5],[61,7,61,8],[61,10,61,11],[59,16,59,17],[46,20,47,20],[53,16,53,19],[54,16,54,19],[57,1,57,2],[57,6,57,7],[57,8,57,9],[57,10,57,11],[57,13,57,14],[57,16,57,17],[59,1,59,2],[59,4,59,5],[59,8,59,9],[59,10,59,11],[59,13,59,15],[39,1,39,2],[39,20,39,21],[30,26,30,27],[30,29,30,30],[32,1,32,2],[32,23,32,24],[32,26,32,27],[32,29,32,30],[30,1,30,2],[30,16,30,17],[30,23,30,24],[34,1,34,2],[35,1,35,2],[36,1,36,2],[36,16,37,16],[36,23,37,24],[22,19,23,19],[22,23,22,24],[24,1,24,2],[25,1,25,2],[28,1,28,2],[17,5,17,6],[17,8,17,9],[17,11,17,13],[19,1,19,18],[21,1,22,6],[21,7,22,7],[21,8,22,10],[21,12,22,14],[21,15,22,17],[4,26,4,28],[4,29,4,31],[6,4,6,7],[6,8,6,9],[12,4,12,5],[0,0,1,1],[2,0,18,1],[2,4,2,7],[2,8,2,9],[2,23,2,24],[4,2,4,4],[4,8,4,9],[4,14,4,15],[4,16,4,17],[4,23,4,25],[13,14,14,14],[13,17,14,17],[14,2,15,4],[15,5,15,6],[15,8,15,9],[15,11,15,13]]}
[]
[]
["DONNEES COURSE",null,"Circuit / Piste :",null,{"$f":"'Strat 1'!$E$3:$H$3","v":0},null,null,null,"Longueur circuit :",null,{"$f":"'Strat 1'!$K$3","v":{"$error":"#N/A"}},"corners :",{"$f":"'Strat 1'!$M$3","v":{"$error":"#N/A"}}]
[]
[null,null,"Catégorie du  véhicule : ",null,null,{"$f":"'Strat 1'!$F$5","v":0},null,null,"Durée de la course :",null,{"$f":"'Strat 1'!$K$5","v":"00:00:00"},"hr     où",{"$f":"'Strat 1'!$M$5","v":0},{"$f":"K5+K58+K7","v":"00:00:40"}]
[]
[null,null,"Modèle :",null,{"$f":"'Strat 1'!$E$7:$H$7","v":0},null,null,null,null,null,"00:00:40"]
[]
[null,null,null,null,"condition usure",null,"type gomme",null,null,null,"condition conso",null,"autonomie",null,"consommation","taux/vol",null,"volume"]
[null,null,null,null,{"$f":"'Strat 1'!$E$10","v":"X1"},null,null,null,null,null,{"$f":"'Strat 1'!$K$10","v":"X1"},null,{"$f":"'Strat 1'!$M$10","v":0},"soit : ",{"$f":"(O11*M12)/M13*K3","v":{"$error":"#N/A"}},{"$f":"(O10*1)/M12","v":{"$error":"#N/A"}},"Jauge initiale :",{"$f":"'Strat 1'!$R$10","v":100}]
[null,null,null,null,null,null,"Temps / tour","nbr tours",null,null,null,null,"pour :",null,1]
[null,null,null,null,null,null,"00:00:00",null,null,null,null,null,100]
[null,null,null,null,null,null,null,null,null,null,null,null,{"$f":"M10*K3","v":{"$error":"#N/A"}}]
[null,null,null,null,null,null,null,null,null,null,null,null,null,null,"Litre/Sec",null,null,"1 tour",null,null,{"$f":"M12/V16","v":{"$error":"#N/A"}}]
[null,null,"Temps d'arrêt au stand :",null,null,null,null,null,null,null,null,null,null,null,null,null,null,null,null,null,"L/KM"]
[null,null,null,null,null,"ENTREE / SORTIE : ",null,{"$f":"PIT!S9-PIT!S7","v":3.5},"ECHANGE PNEUS :  ",null,{"$f":"PIT!S7","v":4.5},"REFUEL vitesse de ravitaillement : ",null,null,{"$f":"PIT!S17","v":6.666666666666667},null,1,{"$f":"PIT!S13","v":{"$error":"#DIV/0!"}},null,null,{"$f":"M10","v":0},{"$f":"K3*M10","v":{"$error":"#N/A"}}]
[null,null,null,null,null,null,null,null,null,null,null,null,null,null,null,null,null,null,null,null,null,"1 plein"]
[null,null,null,null,null,"Echange pneumatiques : ",null,{"$f":"H16+K16","v":8},"Temps pneus + fuel : ",null,{"$f":"H18+(M10*R16)","v":{"$error":"#DIV/0!"}},"Nbr de tours total de refuel : ",null,null,{"$f":"U36","v":{"$error":"#N/A"}},{"$f":"O18*R16","v":{"$error":"#N/A"}}]
[]
[]
[]
[null,"Tableau de bord stratégie de course ",null,null,null,null,null,2,"saisir un temps au tour\ndans données course",null,null,null,null,null,null,"Vous dépassez la durée de\ncourse de plus d'un tour"]
[null,null,null,null,null,null,null,null,null,null,null,null,null,null,null,null,null,null,null,"total nbr de tours"]
[]
[null,"Nbr de tours / pit",null,null,"Départ",null,"Pit 1",null,"Pit 2",null,"Pit 3",null,"Pit 4",null,"Pit 5",null,null,null,null,{"$f":"R25+P25+N25+L25+J25+H25+F25","v":0}]
[null,"Pertes de temps total : purge pénalité..."]
[null,null,"00:00:00",null,null,{"$f":"F25*$K$3","v":{"$error":"#N/A"}},null,{"$f":"H25*$K$3","v":{"$error":"#N/A"}},null,{"$f":"J25*$K$3","v":{"$error":"#N/A"}},null,{"$f":"L25*$K$3","v":{"$error":"#N/A"}},null,{"$f":"N25*$K$3","v":{"$error":"#N/A"}},null,{"$f":"P25*$K$3","v":{"$error":"#N/A"}}]
[]
[null,"Tours & Temps",null,null,null,{"$f":"F25","v":0},{"$f":"F25*E62","v":{"$error":"#N/A"}},{"$f":"F29+H25","v":0},{"$f":"(E62*H25)+G29","v":{"$error":"#N/A"}},{"$f":"H29+J25","v":0},{"$f":"(J25*E62)+I29","v":{"$error":"#N/A"}},{"$f":"J29+L25","v":0},{"$f":"L25*E62+K29","v":{"$error":"#N/A"}},{"$f":"L29+N25","v":0},{"$f":"(N25*E62)+M29","v":{"$error":"#N/A"}},{"$f":"N29+P25","v":0},{"$f":"(P25*E62)+O29","v":{"$error":"#N/A"}},{"$f":"P29+R25","v":0}]
[]
{"$rows_left_out":48}
{"sheet":"Strat 3","index":3,"n_rows":77,"n_cols":22,"rows_kept":77,"cut":false,"hidden":false,"merged":[[60,13,60,14],[61,1,61,2],[61,4,61,5],[61,7,61,8],[61,10,61,11],[59,16,59,17],[46,20,47,20],[53,16,53,19],[54,16,54,19],[57,1,57,2],[57,6,57,7],[57,8,57,9],[57,10,57,11],[57,13,57,14],[57,16,57,17],[59,1,59,2],[59,4,59,5],[59,8,59,9],[59,10,59,11],[59,13,59,15],[39,1,39,2],[39,20,39,21],[30,26,30,27],[30,29,30,30],[32,1,32,2],[32,23,32,24],[32,26,32,27],[32,29,32,30],[30,1,30,2],[30,16,30,17],[30,23,30,24],[34,1,34,2],[35,1,35,2],[36,1,36,2],[36,16,37,16],[36,23,37,24],[22,23,22,24],[24,1,24,2],[25,1,25,2],[28,1,28,2],[21,1,22,6],[21,7,22,7],[21,8,22,10],[21,12,22,14],[21,15,22,17],[17,5,17,6],[17,8,17,9],[17,11,17,13],[19,1,19,18],[22,19,23,19],[4,26,4,28],[4,29,4,31],[6,4,6,7],[6,8,6,9],[12,4,12,5],[0,0,1,1],[2,0,18,1],[2,4,2,7],[2,8,2,9],[2,23,2,24],[4,2,4,4],[4,8,4,9],[4,14,4,15],[4,16,4,17],[4,23,4,25],[13,14,14,14],[13,17,14,17],[14,2,15,4],[15,5,15,6],[15,8,15,9],[15,11,15,13]]}
[]
[]
["DONNEES COURSE",null,"Circuit / Piste :",null,{"$f":"'Strat 1'!$E$3:$H$3","v":0},null,null,null,"Longueur circuit :",null,{"$f":"'Strat 1'!$K$3","v":{"$error":"#N/A"}},"corners :",{"$f":"'Strat 1'!$M$3","v":{"$error":"#N/A"}}]
[]
[null,null,"Catégorie du  véhicule : ",null,null,{"$f":"'Strat 1'!$F$5","v":0},null,null,"Durée de la course :",null,{"$f":"'Strat 1'!$K$5","v":"00:00:00"},"hr     où",{"$f":"'Strat 1'!$M$5","v":0},{"$f":"K5+K58+K7","v":"00:00:40"}]
[]
[null,null,"Modèle :",null,{"$f":"'Strat 1'!$E$7:$H$7","v":0},null,null,null,null,null,"00:00:40"]
[]
[null,null,null,null,"condition usure",null,"type gomme",null,null,null,"condition conso",null,"autonomie",null,"consommation","taux/vol",null,"volume"]
[null,null,null,null,{"$f":"'Strat 1'!$E$10","v":"X1"},null,null,null,null,null,{"$f":"'Strat 1'!$K$10","v":"X1"},null,{"$f":"'Strat 1'!$M$10","v":0},"soit : ",{"$f":"(O11*M12)/M13*K3","v":{"$error":"#N/A"}},{"$f":"(O10*1)/M12","v":{"$error":"#N/A"}},"Jauge initiale :",{"$f":"'Strat 1'!$R$10","v":100}]
[null,null,null,null,null,null,"Temps / tour","nbr tours",null,null,null,null,"pour :",null,1]
[null,null,null,null,null,null,"00:00:00",null,null,null,null,null,100]
[null,null,null,null,null,null,null,null,null,null,null,null,{"$f":"M10*K3","v":{"$error":"#N/A"}}]
[null,null,null,null,null,null,null,null,null,null,null,null,null,null,"Litre/Sec",null,null,"1 tour",null,null,{"$f":"M12/V16","v":{"$error":"#N/A"}}]
[null,null,"Temps d'arrêt au stand :",null,null,null,null,null,null,null,null,null,null,null,null,null,null,null,null,null,"L/KM"]
[null,null,null,null,null,"ENTREE / SORTIE : ",null,{"$f":"PIT!S9-PIT!S7","v":3.5},"ECHANGE PNEUS :  ",null,{"$f":"PIT!S7","v":4.5},"REFUEL vitesse de ravitaillement : ",null,null,{"$f":"PIT!S17","v":6.666666666666667},null,1,{"$f":"PIT!S13","v":{"$error":"#DIV/0!"}},null,null,{"$f":"M10","v":0},{"$f":"K3*M10","v":{"$error":"#N/A"}}]
[null,null,null,null,null,null,null,null,null,null,null,null,null,null,null,null,null,null,null,null,null,"1 plein"]
[null,null,null,null,null,"Echange pneumatiques : ",null,{"$f":"H16+K16","v":8},"Temps pneus + fuel : ",null,{"$f":"H18+(M10*R16)","v":{"$error":"#DIV/0!"}},"Nbr de tours total de refuel : ",null,null,{"$f":"U36","v":{"$error":"#N/A"}},{"$f":"O18*R16","v":{"$error":"#N/A"}}]
[]
[]
[]
[null,"Tableau de bord stratégie de course ",null,null,null,null,null,3,"saisir un temps au tour\ndans données course",null,null,null,null,null,null,"Vous dépassez la durée de\ncourse de plus d'un tour"]
[null,null,null,null,null,null,null,null,null,null,null,null,null,null,null,null,null,null,null,"total nbr de tours"]
[]
[null,"Nbr de tours / pit",null,null,"Départ",null,"Pit 1",null,"Pit 2",null,"Pit 3",null,"Pit 4",null,"Pit 5",null,null,null,null,{"$f":"R25+P25+N25+L25+J25+H25+F25","v":0}]
[null,"Pertes de temps total : purge pénalité..."]
[null,null,"00:00:00",null,null,{"$f":"F25*$K$3","v":{"$error":"#N/A"}},null,{"$f":"H25*$K$3","v":{"$error":"#N/A"}},null,{"$f":"J25*$K$3","v":{"$error":"#N/A"}},null,{"$f":"L25*$K$3","v":{"$error":"#N/A"}},null,{"$f":"N25*$K$3","v":{"$error":"#N/A"}},null,{"$f":"P25*$K$3","v":{"$error":"#N/A"}}]
[]
[null,"Tours & Temps",null,null,null,{"$f":"F25","v":0},{"$f":"F25*E62","v":{"$error":"#N/A"}},{"$f":"F29+H25","v":0},{"$f":"(E62*H25)+G29","v":{"$error":"#N/A"}},{"$f":"H29+J25","v":0},{"$f":"(J25*E62)+I29","v":{"$error":"#N/A"}},{"$f":"J29+L25","v":0},{"$f":"L25*E62+K29","v":{"$error":"#N/A"}},{"$f":"L29+N25","v":0},{"$f":"(N25*E62)+M29","v":{"$error":"#N/A"}},{"$f":"N29+P25","v":0},{"$f":"(P25*E62)+O29","v":{"$error":"#N/A"}},{"$f":"P29+R25","v":0}]
[]
{"$rows_left_out":48}
{"sheet":"grille","index":4,"n_rows":102,"n_cols":13,"rows_kept":102,"cut":false,"hidden":false,"merged":[]}
[]
[]
[null,"pneu","pneu1","condition"]
[null,"S soft","S soft","X1"]
[null,"soft","soft","X2"]
[null,"médium","médium","X3"]
[null,"hard","hard","X4"]
[null,"sans","inter","X5"]
[null,"inter","pluie","X6"]
[null,"pluie",null,"X7"]
[null,null,null,"X8"]
[null,null,null,"X9"]
[null,null,null,"X10"]
[null,null,null,"X11"]
[null,null,null,"X12"]
[null,null,null,"X13"]
[null,null,null,"X14"]
[null,null,null,"X15",null,null,null,null,null,null,"circuits","distance","corner"]
[null,null,null,"X16",null,null,null,null,null,null,"Alsace - Village",5.423,17]
[null,null,null,null,null,null,null,null,null,null,"Alsace - Village II",5.423,17]
[null,null,null,null,null,null,null,null,null,null,"Autodrome Lago Maggiore - GP",5.8090000000000002,17]
[null,null,null,null,null,null,null,null,null,null,"Autodrome Lago Maggiore - GP II",5.8090000000000002,17]
[null,null,null,null,null,null,null,null,null,null,"Autodrome Lago Maggiore - Centre",1.706,9]
[null,null,null,null,null,null,null,null,null,null,"Autodrome Lago Maggiore - Centre II",1.706,9]
[null,null,null,null,null,null,null,null,null,null,"Autodrome Lago Maggiore - Est",3.6429999999999998,13]
[null,null,null,null,null,null,null,null,null,null,"Autodrome Lago Maggiore - Est II",3.6429999999999998,13]
[null,null,null,null,null,null,null,null,null,null,"Autodrome Lago Maggiore - Ouest",4.1680000000000001,13]
[null,null,null,null,null,null,null,null,null,null,"Autodrome Lago Maggiore - Ouest II",4.1680000000000001,13]
[null,null,null,null,null,null,null,null,null,null,"Autódromo De Interlagos",4.3090000000000002,15]
[null,null,null,null,null,null,null,null,null,null,"Autodromo Nazionale Monza",5.7930000000000001,11]
{"$rows_left_out":73}
{"sheet":"PIT","index":5,"n_rows":26,"n_cols":33,"rows_kept":26,"cut":false,"hidden":false,"merged":[[10,32,10,33],[6,16,6,17],[8,19,8,20],[3,16,4,18],[6,19,6,22],[8,16,8,17],[10,16,10,17],[14,16,14,17],[3,12,4,14],[24,12,24,14],[22,12,22,14],[20,12,20,14],[12,16,12,17],[16,16,16,17]]}
[]
[null,null,"Aide au calcul des temps d'arrêts réels aux stands :"]
[]
[null,null,null,null,null,null,null,null,null,null,null,null,"Modifier les temps",null,null,null,"Détail des temps d'arrêt et de ravitaillement"]
[]
[]
[null,null,null,null,null,null,null,null,null,null,null,null,"t3",30,null,null,"Temps démontes et montes des pneus : ",null,4.5," (ce temps ne varie pas sur GT)"]
[]
[null,null,null,null,null,null,null,null,null,null,null,null,null,null,null,null,"Temps réel changement pneus = (t2 - t1)",null,{"$f":"N11-N17","v":8},"(temps sec)",null,null,null,null,null,null,null,null,null,null,null,{"$f":"S9+S11","v":23}]
[]
[null,null,null,null,null,null,null,null,null,null,null,null,"t2",15,null,null,"Temps de remplissage max du réservoir : ",null,{"$f":"N7-N11","v":15},null,{"$f":"S11/U15","v":0.15},"/ litre",null,null,null,null,null,null,null,"Consommation : ",null,{"$f":"U15/S15","v":{"$error":"#DIV/0!"}},"litres/tour"]
[]
[null,null,null,null,null,null,null,null,null,null,null,null,null,null,null,null,"Temps de remplissage pour 1 tour : ",null,{"$f":"AF11*U11","v":{"$error":"#DIV/0!"}}]
[]
[null,null,null,null,null,null,null,null,null,null,null,null,null,null,null,null,"Capacité max réservoir : ",null,{"$f":"'Strat 1'!M10","v":0},null,{"$f":"'Strat 1'!O12","v":100}]
[]
[null,null,null,null,null,null,null,null,null,null,null,null,"t1",7,null,null,"Vitesse de ravitaillement : ",null,{"$f":"(1*U15)/S11","v":6.666666666666667},"litres/seconde"]
[null,null,null,null,null,null,null,null,null,null,null,null,null,null,null,null,"vous pouvez vérifier l'exactitude avec les infos course sur Gran Turismo"]
[]
[]
[null,"t1 = temps de parcours voiture sur la piste entre l'entrée et la sortie des stands",null,null,null,null,null,null,null,null,null,null,"Pour obtenir t1 :",null,null,"relever le temps de passage de votre voiture entre l'entrée et la sortie des stands (en condition course)"]
[]
[null,"t2 = temps d'entrée au stand + temps PIT (changement pneus) + temps de sortie des stands",null,null,null,null,null,null,null,null,null,null,"Pour obtenir t2 :",null,null,"faire un arrêt avec seulement un changement de pneus et relever le temps indiqué sur l'écran en sortie de stand."]
[]
[null,"t3 = temps d'entrée au stand + changement pneus + refuel complet + temps de sortie des stands",null,null,null,null,null,null,null,null,null,null,"Pour obtenir t3 :",null,null,"faire un arrêt avec changement de pneu et refuel complet. Relever le temps d'arrêt indiqué sur l'écran à la sortie"]
[null,null,null,null,null,null,null,null,null,null,null,null,null,null,null," du stand."]

{"sheet":"grille2","index":6,"n_rows":371,"n_cols":5,"rows_kept":371,"cut":false,"hidden":false,"merged":[]}
[]
[]
[]
[null,"catégories",null,"Voitures"]
[null,"GR1_",null,"GR1"]
[null,"GR2_",null,"Alpine VGT 2017"]
[null,"GR3_",null,"Audi Audi VGT"]
[null,"GR4_",null,"Audi R18 (Audi Sport Team Joest) '16"]
[null,"GRB",null,"Audi R18 TDI (Audi Sport Team Joest) '11"]
[null,"GRX",null,"Audi R18 TDI (Le Mans 2011)"]
[null,"N1000_",null,"Bugatti VGT (Gr.1)"]
[null,"N100_",null,"Dodge SRT Tomahawk VGT (Gr.1)"]
[null,"N200_",null,"Hyundai HYUNDAI N 2025 VGT (Gr.1)"]
[null,"N300_",null,"Jaguar XJR-9 '88"]
[null,"N400_",null,"Mazda 787B '91"]
[null,"N500_",null,"Mazda LM55 VGT (Gr.1)"]
[null,"N600_",null,"McLaren Ultimate VGT (Gr.1)"]
[null,"N700_",null,"Mercedes-Benz Sauber Mercedes C9 '89"]
[null,"N800_",null,"Nissan GT-R LM NISMO '15"]
[null,null,null,"Nissan R92CP '92"]
[null,null,null,"Peugeot 908 HDi FAP - Team Peugeot Total '10"]
[null,null,null,"Peugeot L750R HYbrid VGT 2017"]
[null,null,null,"Porsche 919 Hybrid (Porsche Team) '16"]
[null,null,null,"Porsche 962 C '88"]
[null,null,null,"Toyota TS030 Hybrid '12"]
[null,null,null,"Toyota TS050 - Hybrid (Toyota Gazoo Racing) '16"]
[]
[null,null,null,"GR2"]
[null,null,null,"Honda ESPON NSX '08"]
[null,null,null,"Honda RAYBRIG NSX CONCEPT-GT '16"]
{"$rows_left_out":341}