{"text_format":"1","workbook":"xlsx","n_sheets":14,"sheets":["Accueil","Strat 1","Strat 2","Strat 3","comparateur","chronos","ajust éco","PIT","Transmissions","grille","Véhicules","Voitures","Notice","usure"],"not_rendered":{"charts":1,"images":132,"macros":1,"external_links":3,"defined_names":40,"comments":5,"pivot_tables":0},"unopened":[],"bounds":{"document_bytes":16777216,"sheet_cells":100000,"rows_first":2000,"rows_last":500,"rows_between":2000,"halvings":0,"cell_chars":16384,"cell_head_chars":4096},"cells_cut":0,"cells_raw":0,"read":"whole","date_system":"1900"}

{"sheet":"Accueil","index":0,"n_rows":89,"n_cols":19,"rows_kept":89,"cut":false,"hidden":false,"merged":[[28,18,29,21],[5,13,6,14],[30,18,30,21],[1,0,31,0],[32,0,47,15],[22,1,22,2],[30,3,30,4],[9,3,9,6],[15,7,15,8],[17,7,17,8],[15,2,19,2],[30,6,30,7],[14,1,14,2],[19,7,19,8],[28,5,28,8],[27,1,27,3],[1,1,3,11],[8,1,8,2],[3,13,4,15],[8,29,9,37],[8,27,9,27],[8,28,9,28],[5,18,9,21],[5,1,6,5]]}
[]
[null,"Comparateur de stratégies pour "]
[null,null,null,null,null,null,null,null,null,null,null,null,null,"Version :","1.26.1","2022-11-27"]
[]
[]
[null,"Saisie des paramètres course :",null,null,null,null,null,null,null,null,null,null,null,"Ctrl+Maj+F1",null,null,null,null,"Assurez-vous d'utiliser un fichier Excel qui accepte les macros (xlm)\nA l'ouverture répondez oui en cas de question sur la sécurité et pour activer les macros. Plus d'info dans notice utilisation."]
[]
[]
[null,"saisies obligatoires"]
[null,null,"Circuit / Piste : ",null,null,null,null,"Longueur : ",{"$f":"VLOOKUP(D10,grille!K19:L117,2,FALSE)","v":{"$error":"#N/A"}}]
[]
[null,null,"Tours ou temps : ","Tours",0,"00:00:00"]
[]
[]
[null,"saisies obligatoires"]
{"$rows_left_out":75}
{"sheet":"Strat 1","index":1,"n_rows":73,"n_cols":24,"rows_kept":73,"cut":false,"hidden":false,"merged":[[57,1,57,2],[57,5,57,7],[22,1,22,2],[53,9,53,10],[55,9,55,10],[52,1,53,5],[55,5,55,7],[31,1,32,2],[55,1,55,2],[28,1,29,2],[18,1,18,2],[15,1,15,2],[24,1,24,2],[25,1,25,2],[26,1,26,2],[20,1,20,2],[2,2,2,4],[4,13,4,16],[3,13,3,16],[3,2,4,2],[14,1,14,2],[0,0,10,1],[10,2,10,3],[55,13,55,17],[56,13,56,17],[57,13,57,17],[3,29,3,31],[20,29,20,30],[22,16,22,17],[50,16,50,19],[27,16,30,17],[3,26,3,28],[20,16,20,17],[22,26,22,27],[22,29,22,30],[20,26,20,27],[21,16,21,17],[60,0,65,25],[74,0,83,25],[11,23,59,25],[0,23,3,25],[53,13,53,17],[54,13,54,17],[1,4,1,6],[9,10,9,11],[10,5,10,6],[10,8,10,9],[12,5,12,9],[2,5,2,6],[3,5,3,6],[53,12,57,12],[42,20,43,20],[49,16,49,19]]}
["RAPPEL DONNES",null,null,null,null,null,null,null,null,null,null,null,null,null,null,null,null,null,null,null,null,null,null,"Cliquez sur les cellules pour obtenir des informations complémentaires."]
[null,null,"Circuit / Piste :",null,{"$f":"Accueil!D10","v":0},null,null,"Longueur :",{"$f":"Accueil!I10","v":{"$error":"#N/A"}},"Durée :",{"$f":"Accueil!E12","v":0},{"$f":"Accueil!F12","v":"00:00:00"}]
[null,null,"Pit pneus + refuel complet ",null,null,{"$f":"PIT!S11","v":{"$error":"#DIV/0!"}},null,null,null,null,null,null,{"$f":"L2","v":"00:00:00"},"00:00:30",{"$f":"M3+F8+N3","v":"00:02:40"}]
[null,null,"Infos paramètres\ncourse",null,"Pit pneus : ","Temps cumulé de refuel",null,"Autonomie","Ravitaillement","Fuel départ","Conso.","Usure","Catégorie","Véhicule modèle :"]
[null,null,null,null,{"$f":"PIT!S9","v":10},{"$f":"G5*L11","v":{"$error":"#N/A"}},{"$f":"U26","v":{"$error":"#N/A"}},{"$f":"Accueil!J16","v":0},{"$f":"PIT!S19","v":0},{"$f":"Accueil!J20","v":100},{"$f":"Accueil!I31","v":"X1"},{"$f":"Accueil!F31","v":"X1"},{"$f":"Accueil!D29","v":0},{"$f":"Accueil!F29","v":0}]
[]
[null,null,"Infos pneus ",null,{"$f":"chronos!C10","v":0},"Tps moyen","Monte",null,{"$f":"chronos!C12","v":0},"Tps moyen","Monte",null,{"$f":"chronos!C14","v":0},"Tps moyen","Monte",null,"sans"]
[null,null,"Pic Performance",null,{"$f":"chronos!G10","v":8},{"$f":"chronos!E10","v":"00:02:10"},{"$f":"Accueil!F16","v":"libre"},"Pic P ",{"$f":"chronos!G12","v":12},{"$f":"chronos!E12","v":"00:02:12"},{"$f":"Accueil!F18","v":"libre"},"Pic P ",{"$f":"chronos!G14","v":16},{"$f":"chronos!E14","v":"02,14,0"},{"$f":"Accueil!F20","v":"libre"},null,{"$f":"F8","v":"00:02:10"}]
[]
[null,null,"volume",null,{"$f":"Accueil!K16","v":100},"soit","consommation",{"$f":"'ajust éco'!D9*'Strat 1'!I2","v":{"$error":"#N/A"}},"1 tour",{"$f":"(H10*1)/E10","v":{"$error":"#N/A"}},"Jauge initiale : ",null,{"$f":"Accueil!J20","v":100}]
[null,null,"ENTREE / SORTIE : ",null,{"$f":"PIT!S9-PIT!S7","v":5.5},"démonte/monte pneus :",null,{"$f":"PIT!S7","v":4.5},"Tps remplissage",null,1,{"$f":"PIT!S15","v":{"$error":"#DIV/0!"}},null,null,null,null,null,null,null,null,{"$f":"H5","v":0},{"$f":"I2*H5","v":{"$error":"#N/A"}}]
[]
[null,null,null,null,null,"Au moins un type de gomme obligatoire n'est pas utilisé !"]
[null,null,null,null,null,null,null,null,null,null,null,null,null,null,null,null,null,null,null,"total nbr de tours"]
[null,null,null,null,"Départ",null,"Pit 1",null,"Pit 2",null,"Pit 3",null,"Pit 4",null,"Pit 5",null,null,null,null,{"$f":"R15+P15+N15+L15+J15+H15+F15","v":0}]
{"$rows_left_out":59}
{"sheet":"Strat 2","index":2,"n_rows":73,"n_cols":24,"rows_kept":73,"cut":false,"hidden":false,"merged":[[26,1,26,2],[3,26,3,28],[3,29,3,31],[4,13,4,16],[9,10,9,11],[10,2,10,3],[10,5,10,6],[10,8,10,9],[0,0,10,1],[0,23,3,25],[1,4,1,6],[2,2,2,4],[2,5,2,6],[3,2,4,2],[3,5,3,6],[3,13,3,16],[50,16,50,19],[20,26,20,27],[20,29,20,30],[22,1,22,2],[22,16,22,17],[22,26,22,27],[22,29,22,30],[11,23,59,25],[12,5,12,9],[14,1,14,2],[15,1,15,2],[18,1,18,2],[20,1,20,2],[20,16,20,17],[24,1,24,2],[25,1,25,2],[27,16,30,17],[28,1,29,2],[31,1,32,2],[42,20,43,20],[49,16,49,19],[60,0,65,25],[74,0,83,25],[52,1,53,5],[53,9,53,10],[53,12,57,12],[53,13,53,17],[54,13,54,17],[55,1,55,2],[55,5,55,7],[55,9,55,10],[55,13,55,17],[56,13,56,17],[57,1,57,2],[57,5,57,7],[57,13,57,17]]}
["RAPPEL DONNES",null,null,null,null,null,null,null,null,null,null,null,null,null,null,null,null,null,null,null,null,null,null,"Cliquez sur les cellules pour obtenir des informations complémentaires."]
[null,null,"Circuit / Piste :",null,{"$f":"Accueil!D10","v":0},null,null,"Longueur :",{"$f":"Accueil!I10","v":{"$error":"#N/A"}},"Durée :",{"$f":"Accueil!E12","v":0},{"$f":"Accueil!F12","v":"00:00:00"}]
[null,null,"Pit pneus + refuel complet ",null,null,{"$f":"PIT!S11","v":{"$error":"#DIV/0!"}},null,null,null,null,null,null,{"$f":"L2","v":"00:00:00"},"00:00:30",{"$f":"M3+F8+N3","v":"00:02:40"}]
[null,null,"Infos paramètres\ncourse",null,"Pit pneus : ","Temps cumulé de refuel",null,"Autonomie","Ravitaillement","Fuel départ","Conso.","Usure","Catégorie","Véhicule modèle :"]
[null,null,null,null,{"$f":"PIT!S9","v":10},{"$f":"G5*L11","v":{"$error":"#N/A"}},{"$f":"U26","v":{"$error":"#N/A"}},{"$f":"Accueil!J16","v":0},{"$f":"PIT!S19","v":0},{"$f":"Accueil!J20","v":100},{"$f":"Accueil!I31","v":"X1"},{"$f":"Accueil!F31","v":"X1"},{"$f":"Accueil!D29","v":0},{"$f":"Accueil!F29","v":0}]
[]
[null,null,"Infos pneus ",null,{"$f":"chronos!C10","v":0},"Tps moyen","Monte",null,{"$f":"chronos!C12","v":0},"Tps moyen","Monte",null,{"$f":"chronos!C14","v":0},"Tps moyen","Monte",null,"sans"]
[null,null,"Pic Performance",null,{"$f":"chronos!G10","v":8},{"$f":"chronos!E10","v":"00:02:10"},{"$f":"Accueil!F16","v":"libre"},"Pic P ",{"$f":"chronos!G12","v":12},{"$f":"chronos!E12","v":"00:02:12"},{"$f":"Accueil!F18","v":"libre"},"Pic P ",{"$f":"chronos!G14","v":16},{"$f":"chronos!E14","v":"02,14,0"},{"$f":"Accueil!F20","v":"libre"},null,{"$f":"F8","v":"00:02:10"}]
[]
[null,null,"volume",null,{"$f":"Accueil!K16","v":100},"soit","consommation",{"$f":"'ajust éco'!D9*'Strat 2'!I2","v":{"$error":"#N/A"}},"1 tour",{"$f":"(H10*1)/E10","v":{"$error":"#N/A"}},"Jauge initiale : ",null,{"$f":"Accueil!J20","v":100}]
[null,null,"ENTREE / SORTIE : ",null,{"$f":"PIT!S9-PIT!S7","v":5.5},"démonte/monte pneus :",null,{"$f":"PIT!S7","v":4.5},"Tps remplissage",null,1,{"$f":"PIT!S15","v":{"$error":"#DIV/0!"}},null,null,null,null,null,null,null,null,{"$f":"H5","v":0},{"$f":"I2*H5","v":{"$error":"#N/A"}}]
[]
[null,null,null,null,null,"Au moins un type de gomme obligatoire n'est pas utilisé !"]
[null,null,null,null,null,null,null,null,null,null,null,null,null,null,null,null,null,null,null,"total nbr de tours"]
[null,null,null,null,"Départ",null,"Pit 1",null,"Pit 2",null,"Pit 3",null,"Pit 4",null,"Pit 5",null,null,null,null,{"$f":"R15+P15+N15+L15+J15+H15+F15","v":0}]
{"$rows_left_out":59}
{"sheet":"Strat 3","index":3,"n_rows":73,"n_cols":24,"rows_kept":73,"cut":false,"hidden":false,"merged":[[26,1,26,2],[3,26,3,28],[3,29,3,31],[4,13,4,16],[9,10,9,11],[10,2,10,3],[10,5,10,6],[10,8,10,9],[0,0,10,1],[0,23,3,25],[1,4,1,6],[2,2,2,4],[2,5,2,6],[3,2,4,2],[3,5,3,6],[3,13,3,16],[50,16,50,19],[20,26,20,27],[20,29,20,30],[22,1,22,2],[22,16,22,17],[22,26,22,27],[22,29,22,30],[11,23,59,25],[12,5,12,9],[14,1,14,2],[15,1,15,2],[18,1,18,2],[20,1,20,2],[20,16,20,17],[24,1,24,2],[25,1,25,2],[27,16,30,17],[28,1,29,2],[31,1,32,2],[42,20,43,20],[49,16,49,19],[60,0,65,25],[74,0,83,25],[52,1,53,5],[53,9,53,10],[53,12,57,12],[53,13,53,17],[54,13,54,17],[55,1,55,2],[55,5,55,7],[55,9,55,10],[55,13,55,17],[56,13,56,17],[57,1,57,2],[57,5,57,7],[57,13,57,17]]}
["RAPPEL DONNES",null,null,null,null,null,null,null,null,null,null,null,null,null,null,null,null,null,null,null,null,null,null,"Cliquez sur les cellules pour obtenir des informations complémentaires."]
[null,null,"Circuit / Piste :",null,{"$f":"Accueil!D10","v":0},null,null,"Longueur :",{"$f":"Accueil!I10","v":{"$error":"#N/A"}},"Durée :",{"$f":"Accueil!E12","v":0},{"$f":"Accueil!F12","v":"00:00:00"}]
[null,null,"Pit pneus + refuel complet ",null,null,{"$f":"PIT!S11","v":{"$error":"#DIV/0!"}},null,null,null,null,null,null,{"$f":"L2","v":"00:00:00"},"00:00:30",{"$f":"M3+F8+N3","v":"00:02:40"}]
[null,null,"Infos paramètres\ncourse",null,"Pit pneus : ","Temps cumulé de refuel",null,"Autonomie","Ravitaillement","Fuel départ","Conso.","Usure","Catégorie","Véhicule modèle :"]
[null,null,null,null,{"$f":"PIT!S9","v":10},{"$f":"G5*L11","v":{"$error":"#N/A"}},{"$f":"U26","v":{"$error":"#N/A"}},{"$f":"Accueil!J16","v":0},{"$f":"PIT!S19","v":0},{"$f":"Accueil!J20","v":100},{"$f":"Accueil!I31","v":"X1"},{"$f":"Accueil!F31","v":"X1"},{"$f":"Accueil!D29","v":0},{"$f":"Accueil!F29","v":0}]
[]
[null,null,"Infos pneus ",null,{"$f":"chronos!C10","v":0},"Tps moyen","Monte",null,{"$f":"chronos!C12","v":0},"Tps moyen","Monte",null,{"$f":"chronos!C14","v":0},"Tps moyen","Monte",null,"sans"]
[null,null,"Pic Performance",null,{"$f":"chronos!G10","v":8},{"$f":"chronos!E10","v":"00:02:10"},{"$f":"Accueil!F16","v":"libre"},"Pic P ",{"$f":"chronos!G12","v":12},{"$f":"chronos!E12","v":"00:02:12"},{"$f":"Accueil!F18","v":"libre"},"Pic P ",{"$f":"chronos!G14","v":16},{"$f":"chronos!E14","v":"02,14,0"},{"$f":"Accueil!F20","v":"libre"},null,{"$f":"F8","v":"00:02:10"}]
[]
[null,null,"volume",null,{"$f":"Accueil!K16","v":100},"soit","consommation",{"$f":"'ajust éco'!D9*'Strat 3'!I2","v":{"$error":"#N/A"}},"1 tour",{"$f":"(H10*1)/E10","v":{"$error":"#N/A"}},"Jauge initiale : ",null,{"$f":"Accueil!J20","v":100}]
[null,null,"ENTREE / SORTIE : ",null,{"$f":"PIT!S9-PIT!S7","v":5.5},"démonte/monte pneus :",null,{"$f":"PIT!S7","v":4.5},"Tps remplissage",null,1,{"$f":"PIT!S15","v":{"$error":"#DIV/0!"}},null,null,null,null,null,null,null,null,{"$f":"H5","v":0},{"$f":"I2*H5","v":{"$error":"#N/A"}}]
[]
[null,null,null,null,null,"Au moins un type de gomme obligatoire n'est pas utilisé !"]
[null,null,null,null,null,null,null,null,null,null,null,null,null,null,null,null,null,null,null,"total nbr de tours"]
[null,null,null,null,"Départ",null,"Pit 1",null,"Pit 2",null,"Pit 3",null,"Pit 4",null,"Pit 5",null,null,null,null,{"$f":"R15+P15+N15+L15+J15+H15+F15","v":0}]
{"$rows_left_out":59}
{"sheet":"comparateur","index":4,"n_rows":87,"n_cols":37,"rows_kept":87,"cut":false,"hidden":false,"merged":[[3,2,3,3],[3,16,3,22],[35,14,35,16],[21,14,21,16],[7,14,7,16],[11,4,12,4],[11,6,12,6],[11,8,12,8],[14,4,15,4],[14,6,15,6],[14,8,15,8],[28,11,29,12],[28,13,29,13],[11,11,12,12],[21,11,21,12],[11,17,12,17],[3,36,3,38],[7,11,7,12],[17,29,17,31],[17,20,17,22],[17,23,17,25],[11,13,12,13],[14,17,15,17],[14,13,15,13],[14,11,15,12],[11,27,12,27],[11,29,12,29],[11,31,12,31],[17,14,17,16],[11,14,12,16],[11,25,12,25],[9,14,9,16],[49,23,49,29],[27,36,28,37],[7,4,7,8],[45,14,45,16],[17,26,17,28],[23,14,23,16],[31,14,31,16],[35,11,35,12],[45,29,45,31],[31,29,31,31],[31,26,31,28],[45,26,45,28],[31,23,31,25],[45,20,45,22],[45,23,45,25],[31,20,31,22],[14,14,15,16],[11,20,12,20],[11,21,12,21],[25,27,26,27],[11,23,12,23],[25,29,26,29],[25,31,26,31],[25,11,26,12],[25,13,26,13],[25,14,26,16],[25,17,26,17],[25,25,26,25],[25,21,26,21],[25,23,26,23],[25,20,26,20],[39,13,40,13],[39,11,40,12],[28,17,29,17],[37,14,37,16],[39,17,40,17],[28,14,29,16],[7,37,7,39],[35,36,47,38],[3,4,3,9],[7,2,45,2],[42,17,43,17],[39,31,40,31],[39,20,40,20],[39,21,40,21],[39,23,40,23],[39,25,40,25],[39,27,40,27],[39,29,40,29],[42,14,43,16],[42,11,43,12],[42,13,43,13],[39,14,40,16]]}
[]
[]
[]
[null,null,"Circuit :",null,{"$f":"'Strat 1'!E2","v":0},null,null,null,null,null,null,{"$f":"'Strat 1'!G54","v":0},null,"Catégorie :",{"$f":"'Strat 1'!M5","v":0},"Voiture :",{"$f":"'Strat 1'!N5","v":0}]
[]
[]
[]
[null,null,"COMPARATEUR  STRAT",null,null,null,null,null,null,null,null,"Stratégie 1",null,null,"Indice de risque :",null,null,{"$f":"T69","v":0},null,null,"Type pneus :",{"$f":"'Strat 1'!$E$23","v":0},null,{"$f":"'Strat 1'!$G$23","v":0},null,{"$f":"'Strat 1'!$I$23","v":0},null,{"$f":"'Strat 1'!$K$23","v":0},null,{"$f":"'Strat 1'!$M$23","v":0},null,{"$f":"'Strat 1'!$O$23","v":0}]
[null,null,null,null,"type",null,"tps moyen",null,"durée",null,null,null,null,null,null,null,null,null,null,null,"Pit","Dép.",null,"P1",null,"P2",null,"P3",null,"P4",null,"P5"]
[null,null,null,null,{"$f":"chronos!C10","v":0},null,{"$f":"chronos!E10","v":"00:02:10"},null,{"$f":"'Strat 1'!E8","v":8},null,null,null,null,"STOP PIT","Durée course : ",null,null,{"$f":"'Strat 1'!$I$54","v":{"$error":"#N/A"}},{"$f":"R10*24","v":{"$error":"#N/A"}},null,"Nbr de tours :",{"$f":"'Strat 1'!$F$15","v":0},null,{"$f":"'Strat 1'!$H$15","v":0},null,{"$f":"'Strat 1'!$J$15","v":0},null,{"$f":"'Strat 1'!$L$15","v":0},null,{"$f":"'Strat 1'!$N$15","v":0},null,{"$f":"'Strat 1'!$P$15","v":0}]
[]
[null,null,null,null,{"$f":"chronos!C12","v":0},null,{"$f":"chronos!E12","v":"00:02:12"},null,{"$f":"'Strat 1'!I8","v":12},null,null,"Nombre : ",null,{"$f":"'Strat 1'!$E$56","v":{"$error":"#N/A"}},"Distance : ",null,null,{"$f":"IF('Strat 1'!$L$54=0,\"\",'Strat 1'!$L$54)","v":{"$error":"#N/A"}},null,null,"Conduite éco :",{"$f":"'Strat 1'!$E$32","v":0},null,{"$f":"'Strat 1'!$G$32","v":0},null,{"$f":"'Strat 1'!$I$32","v":0},null,{"$f":"'Strat 1'!$K$32","v":0},null,{"$f":"'Strat 1'!$M$32","v":0},null,{"$f":"'Strat 1'!$O$32","v":0}]
[]
[]
[null,null,null,null,{"$f":"chronos!C14","v":0},null,{"$f":"chronos!E14","v":"02,14,0"},null,{"$f":"'Strat 1'!M8","v":16},null,null,"Cumul temps arrêt : ",null,{"$f":"'Strat 1'!$V$51","v":{"$error":"#N/A"}},"Vitesse moyenne : ",null,null,{"$f":"R12/S10","v":{"$error":"#N/A"}},null,null,"Usures pneus : "]
{"$rows_left_out":73}
{"sheet":"chronos","index":5,"n_rows":70,"n_cols":21,"rows_kept":70,"cut":false,"hidden":false,"merged":[[26,6,26,8],[14,16,14,20],[23,11,23,15],[22,2,22,4],[1,2,1,5],[5,6,7,6],[1,6,1,10],[1,12,1,14],[3,12,3,14],[5,13,7,13],[14,2,14,13]]}
[]
[null,null,"Relevés des temps :",null,null,null,"Essais libres 1",null,null,null,null,null,"Essais libres 2"]
[]
[null,null,"Indiquez :",null,"obligatoire",null,"facultatif",null,"facultatif",null,"facultatif",null,"indications facultatives"]
[]
[null,null,null,null,"Temps moyen",null,"Durée train de pneus\nou pic performance",null,"Répartition",null,"usure train",null,"Temps moyen","Durée train de pneus\nou pic performance","usure train"]
[]
[]
[]
[null,null,{"$f":"Accueil!D16","v":0},null,"00:02:10",null,8,null,0,null,null,null,{"$f":"E10","v":"00:02:10"},0,null,null,{"$f":"M10","v":"00:02:10"}]
[]
[null,null,{"$f":"Accueil!D18","v":0},null,"00:02:12",null,12,null,0,null,null,null,{"$f":"E12","v":"00:02:12"},0,null,null,{"$f":"M12","v":"00:02:12"}]
[]
[null,null,{"$f":"Accueil!D20","v":0},null,"02,14,0",null,16,null,0,null,null,null,{"$f":"E14","v":"02,14,0"},0,null,null,{"$f":"M14","v":"02,14,0"}]
[null,null,"! Vous devez indiquer un temps pour chacune des gommes utilisées, les autres informations n'ont qu'une valeur indicative d'aide à la décision"]
{"$rows_left_out":56}
{"sheet":"ajust éco","index":6,"n_rows":66,"n_cols":16,"rows_kept":66,"cut":false,"hidden":false,"merged":[[50,1,50,2],[3,15,4,15],[12,14,12,16],[5,1,6,1],[5,8,5,11],[30,1,30,7],[5,2,5,6],[20,1,21,2],[18,14,19,19],[1,1,3,11]]}
[]
[null,"Conduite mode éco : ajustements autonomie et temps"]
[]
[null,null,null,null,null,null,null,null,null,null,null,null,null,null,null,"Menu"]
[]
[null,"Réglages\nconduite éco","Gain autonomie",null,null,null,null,null,"Dégradation temps"]
[null,null,"Coeff.",{"$f":"'Strat 1'!H10","v":{"$error":"#N/A"}},{"$f":"'Strat 1'!H5*'Strat 1'!I2","v":{"$error":"#N/A"}},"Gain nbr tours","L/100","réservoir","Sec/Km","pas à pas","Sec/Km","Sec/tour"]
[]
[null,0,0,{"$f":"(1*G9)/$E$7","v":{"$error":"#N/A"}},"écart conso",0,{"$f":"'Strat 1'!E10","v":100},100,0,0,0,0]
[null,"tr/mn 2/3",4,{"$f":"(1*G10)/$E$7","v":{"$error":"#N/A"}},{"$f":"C10+$B$65","v":8},{"$f":"(H10*$A$11)/$H$9-$A$11","v":0},{"$f":"$G$9-E10","v":92},{"$f":"$H$9+E10","v":108},{"$f":"J10+($B$66/50)","v":0.01},{"$f":"K10","v":0.01},0.01,{"$f":"I10*$D$46","v":{"$error":"#N/A"}}]
[{"$f":"'Strat 1'!H5","v":0},"tr/mn 1/2",8,{"$error":"#N/A"},12,0,{"$f":"$G$9-E11","v":88},{"$f":"$H$9+E11","v":112},{"$f":"J11+($B$66/50)","v":3.5000000000000003E-2},{"$f":"K11+K10","v":3.5000000000000003E-2},2.5000000000000001E-2,{"$error":"#N/A"}]
[null,"tr/mn 1/3",16,{"$error":"#N/A"},20,0,80,120,0.1,{"$f":"K12+K11","v":0.1},7.4999999999999997E-2,{"$error":"#N/A"}]
[null,2,20,{"$error":"#N/A"},24,0,76,124,0.17499999999999999,{"$f":"K13+K12","v":0.17499999999999999},0.1,{"$error":"#N/A"},null,null,"Réinitialiser :"]
[null,3,30,{"$error":"#N/A"},34,0,66,134,0.25,{"$f":"K13+K14","v":0.25},0.15,{"$error":"#N/A"}]
[null,4,45,{"$error":"#N/A"},49,0,51,149,0.35,0.35,0.2,{"$error":"#N/A"}]
{"$rows_left_out":52}
{"sheet":"PIT","index":7,"n_rows":25,"n_cols":33,"rows_kept":25,"cut":false,"hidden":false,"merged":[[24,1,26,9],[21,1,22,10],[1,12,1,14],[1,1,1,10],[16,16,16,17],[14,16,14,17],[18,12,18,13],[18,16,18,17],[3,16,4,21],[13,12,13,14],[5,13,7,13],[5,12,6,12],[9,12,11,12],[15,12,17,12],[12,32,12,33],[6,16,6,17],[8,19,8,20],[6,19,6,22],[8,16,8,17],[12,16,12,17],[10,16,10,17]]}
[]
[null,"Saisies des temps d'arrêts aux stands :",null,null,null,null,null,null,null,null,null,null,"indiquez t1 et t2"]
[]
[null,null,null,null,null,null,null,null,null,null,null,null,null,null,null,null,"Informations et détails des temps d'arrêts et de ravitaillements"]
[]
[null,null,null,null,null,null,null,null,null,null,null,null,"t3","calcul automatique avec la saisie de la vitesse de ravitaillement"]
[null,null,null,null,null,null,null,null,null,null,null,null,null,null,null,null,"Temps démontes et montes des pneus : ",null,4.5,"(modifier si nécessaire)"]
[]
[null,null,null,null,null,null,null,null,null,null,null,null,null,null,null,null,"Temps réel changement pneus = (t2 - t1)",null,{"$f":"N11-N17","v":10},null,null,null,null,null,null,null,null,null,null,null,null,{"$f":"S9+S13","v":{"$error":"#DIV/0!"}}]
[null,null,null,null,null,null,null,null,null,null,null,null,"t2"]
[null,null,null,null,null,null,null,null,null,null,null,null,null,20,null,null,"t3 Temps réel change pneus + refuel complet : ",null,{"$f":"AF9","v":{"$error":"#DIV/0!"}}]
[]
[null,null,null,null,null,null,null,null,null,null,null,null,null,null,null,null,"Temps de remplissage max du réservoir : ",null,{"$f":"U17/S19","v":{"$error":"#DIV/0!"}},null,{"$f":"S13/U17","v":{"$error":"#DIV/0!"}},"/ litre",null,null,null,null,null,null,null,"Consommation : ",null,{"$f":"U17/S17","v":{"$error":"#DIV/0!"}},"litres/tour"]
[]
[null,null,null,null,null,null,null,null,null,null,null,null,null,null,null,null,"Temps de remplissage pour 1 tour : ",null,{"$f":"AF13*U13","v":{"$error":"#DIV/0!"}}]
{"$rows_left_out":11}
{"sheet":"Transmissions","index":8,"n_rows":140,"n_cols":14,"rows_kept":140,"cut":false,"hidden":false,"merged":[[139,13,147,15],[1,0,1,11],[13,13,21,15],[43,13,51,15],[76,13,84,15],[110,13,118,15]]}
[]
["TYPES DE TRANSMISSIONS"]
[]
[]
[]
[]
[]
[]
[]
[]
[]
[]
[]
[null,null,null,null,null,null,null,null,null,null,null,null,null,"FR"]
[]
{"$rows_left_out":126}
{"sheet":"grille","index":9,"n_rows":117,"n_cols":15,"rows_kept":117,"cut":false,"hidden":false,"merged":[]}
[]
[]
["nbrtours","pneu","pneu1","usure","conso",null,"fuel","éco2","pneu2","frein",null,null,null,"pneu3","durée"]
[{"$f":"chronos!G10","v":8},"soft","soft","X1","X1",null,0,0,"libre",5,null,null,null,{"$f":"'Strat 1'!E7","v":0},"Temps"]
[{"$f":"chronos!J15","v":0},"médium","médium","X2","X2",null,0.5,"tr/mn 2/3","obligatoire",4,null,null,null,{"$f":"'Strat 1'!I7","v":0},"Tours"]
[{"$f":"chronos!N15","v":0},"hard","hard","X3","X3",null,1,"tr/mn 1/2",null,3,null,null,null,{"$f":"'Strat 1'!M7","v":0}]
[null,"sans","inter","X4","X4",null,1.5,"tr/mn 1/3",null,2,null,null,null,"sans"]
[null,"inter","pluie","X5","X5",null,2,2,null,1]
[null,"pluie","/","X6","X6",null,3,3,null,0]
[null,"/",null,"X7","X7",null,4,4,null,-1]
[null,null,null,"X8","X8",null,5,5,null,-2]
[null,null,null,"X9","X9",null,6,6,null,-3]
[null,null,null,"X10","X10",null,null,null,null,-4]
[null,null,null,"X11","X11",null,null,null,null,-5]
[null,null,null,"X12","X12"]
{"$rows_left_out":103}
{"sheet":"Véhicules","index":10,"n_rows":455,"n_cols":15,"rows_kept":455,"cut":false,"hidden":false,"merged":[[3,5,3,7],[1,1,1,4]]}
[]
[null,"Cliquez sur un modèle de voiture pour accéder à ses caractéristiques",null,null,null,null,null,null,null,null,null,null,null,null,{"$f":"B455","v":451}]
[]
[null,"N°","Catégorie","Marque","Modèle","Dernière mise à jour :",null,null,"version","1.25","Gran Turismo 7"]
[null,1,"No Gr","Abarth","1500 Biposto Bertone B.A.T 1 '52"]
[null,2,"No Gr","Abarth","500 '09"]
[null,3,"No Gr","Abarth","595 SS '70"]
[null,4,"Gr.4","Alfa Romeo","155 2.5 V6 TI '93"]
[null,5,"No Gr","Alfa Romeo","4C '14"]
[null,6,"Gr.3","Alfa Romeo","4C Gr.3"]
[null,7,"No Gr","Alfa Romeo","4C Gr.3 Road Car"]
[null,8,"Gr.4","Alfa Romeo","4C Gr.4"]
[null,9,"No Gr","Alfa Romeo","8C Competizione '08"]
[null,10,"No Gr","Alfa Romeo","GIULIA TZ2 carrozzata da ZAGATO '65"]
[null,11,"No Gr","Alfa Romeo","MiTo '09"]
{"$rows_left_out":441}
{"sheet":"Voitures","index":11,"n_rows":476,"n_cols":7,"rows_kept":476,"cut":false,"hidden":false,"merged":[[1,2,2,2],[1,1,2,1],[1,3,2,3],[1,6,1,7]]}
[]
[null,"Catégorie",null,null,null,null,"Rechercher : ctrl+F"]
[]
[null,"Gr1_"]
[null,"Gr2_"]
[null,"Gr3_"]
[null,"Gr4_"]
[null,"GrB"]
[null,"SF"]
[null,"No_Gr"]
[]
[null,null,null,"mise à jour 1.26 GT"]
[null,null,null,"Gr1_"]
[null,null,null,"Alpine Alpine VGT '17"]
[null,null,null,"Audi Audi VGT"]
{"$rows_left_out":462}
{"sheet":"Notice","index":12,"n_rows":253,"n_cols":18,"rows_kept":253,"cut":false,"hidden":false,"merged":[[206,7,206,13],[99,10,104,13],[139,2,139,12],[181,2,181,8],[182,2,182,8],[183,2,183,8],[193,6,193,11],[252,4,253,7],[0,0,1,13],[38,1,38,5],[44,1,45,6],[46,1,48,6],[196,10,200,13],[68,11,68,19],[69,17,69,18],[95,10,98,13],[147,1,148,13],[150,1,153,1],[91,10,94,13],[149,1,149,13],[69,13,69,16],[171,1,171,13],[201,10,204,13]]}
["NOTICE  D'UTILISATION"]
[]
[null,"Application pour l'élaboration et le choix de stratégie de course"]
[null,"Utilisable pour des courses dont la durée est définie par une limite de temps ou un nombre de tours,"]
[null,"En préalable :"]
[null,"! A l'ouverture du fichier si le message ci-dessous apparait, cliquez sur ",null,null,null,null,null,null,null,null,null,null,null,null,null,null,"Astuce d'affichage pour un meilleur confort en mode course"]
[]
[null,"! Pour utiliser pleinement le comparateur vous devez disposer d'un fichier Excel qui accepte les macros (fichier xlm)"]
[null,"A l'ouverture du comparateur si les messages ci-dessous apparaissent"]
[]
[]
[]
[]
[]
[null,"Vous devez activer les macros :"]
{"$rows_left_out":239}
{"sheet":"usure","index":13,"n_rows":71,"n_cols":26,"rows_kept":71,"cut":false,"hidden":false,"merged":[[2,25,6,28],[0,25,1,28],[0,4,3,5],[0,11,3,12],[0,18,3,19],[0,0,3,3],[18,1,19,1],[30,1,31,1],[11,1,12,1],[9,1,10,1],[6,1,7,1],[15,0,15,3],[27,0,27,3]]}
["Essais libres :",null,null,null,1,null,null,null,null,null,null,2,null,null,null,null,null,null,3,null,null,null,null,null,null,"Usure des gommes"]
[null,null,null,null,null,null,null,{"$f":"chronos!G10","v":8},null,null,null,null,null,null,{"$f":"chronos!J15","v":0},null,null,null,null,null,null,{"$f":"chronos!N15","v":0}]
[null,null,null,null,null,null,null,null,null,null,null,null,null,null,null,null,null,null,null,null,null,null,null,null,null,"Vous pouvez indiquer pour mémoire l'usure pour chacun des pneus dans les cellules à fonds jaunes.\nNombre entier\nValeur de 0 à 10"]
[]
[]
[]
[null,"Gommes 1"]
[]
[null,{"$f":"chronos!C10","v":0}]
[]
[]
[]
[null,null,null,null,null,null,{"$f":"G6","v":0},null,{"$f":"I6","v":0},null,null,null,null,{"$f":"N6","v":0},null,{"$f":"P6","v":0},null,null,null,null,{"$f":"U6","v":0},null,{"$f":"W6","v":0}]
[]
[]
{"$rows_left_out":56}