{"text_format":"1","workbook":"xlsx","n_sheets":14,"sheets":["Notice","Strat 1","Strat 2","strat 3","comparateur","chronos","nbr tours","ajust éco","circuits","voitures","Transmissions","grille","grille2","PIT"],"not_rendered":{"charts":1,"images":177,"macros":1,"external_links":2,"defined_names":43,"comments":6,"pivot_tables":0},"unopened":[],"bounds":{"document_bytes":16777216,"sheet_cells":100000,"rows_first":2000,"rows_last":500,"rows_between":2000,"halvings":0,"cell_chars":16384,"cell_head_chars":4096},"cells_cut":0,"cells_raw":0,"read":"whole","date_system":"1900"}

{"sheet":"Notice","index":0,"n_rows":328,"n_cols":32,"rows_kept":328,"cut":false,"hidden":false,"merged":[[1,0,2,0],[327,5,328,7],[24,2,24,8],[166,6,166,13],[169,5,174,8],[175,5,178,8],[284,7,284,13],[28,0,29,13],[259,2,259,8],[260,2,260,8],[261,2,261,8],[0,12,1,13],[0,3,2,10],[111,1,111,3],[115,8,115,13],[114,8,114,13],[4,31,5,39],[14,2,14,7],[18,2,18,8],[63,10,63,11],[1,21,2,23],[2,12,2,13],[1,16,2,20],[4,29,5,29],[4,30,5,30],[0,1,2,1],[56,1,57,6],[58,1,60,6],[65,7,65,12],[103,10,103,13],[21,2,21,8],[32,9,34,12],[52,1,52,5],[271,6,271,11],[274,10,278,13],[279,10,282,13],[236,2,236,12],[119,8,119,13],[120,8,120,13],[200,10,205,13],[192,10,195,13],[196,10,199,13],[145,1,145,9],[188,1,189,2],[125,1,125,7],[140,1,141,13],[143,1,144,13],[146,1,149,1]]}
[null,"by",null,"Comparateur de stratégies",null,null,null,null,null,null,null,null,"version"]
[null,null,null,null,null,null,null,null,null,null,null,null,null,null,null,null,"Signalez un problèmes, un bug, des questions ?",null,null,null,null,"bigbang.contact@orange.fr"]
[null,null,null,null,null,null,null,null,null,null,null,null,{"$f":"MAX(AD7:AD40)","v":6.1}]
[]
[null,null,"Vous devez vous assurer que les macros et le mode protégé sont activés.",null,null,null,null,null,null,null,null,null,null,null,null,null,null,null,null,null,null,null,null,null,null,null,null,null,null,"Versions","Date","Mises à jour"]
[null,null,"A l'ouverture d'Excel si les messages ci-dessous apparaissent, cliquez sur \"activer le contenu\" et \"activer la modification\"."]
[null,null,null,null,null,null,null,null,null,null,null,null,null,null,null,null,null,null,null,null,null,null,null,null,null,null,null,null,null,1.1000000000000001,"2021-04-25","Amélioration calcul gestion fuel/autonomie (compte tour, éco fuel)"]
[null,null,null,null,null,null,null,null,null,null,null,null,null,null,null,null,null,null,null,null,null,null,null,null,null,null,null,null,null,2,"2021-05-15","Amélioration précision calcul temps moyen au tour"]
[null,null,null,null,null,null,null,null,null,null,null,null,null,null,null,null,null,null,null,null,null,null,null,null,null,null,null,null,null,2.1,"2021-05-19","Correction bug \"erreur d'exécution 1004\" des macros"]
[null,null,null,null,null,null,null,null,null,null,null,null,null,null,null,null,null,null,null,null,null,null,null,null,null,null,null,null,null,3,"2021-05-22","Amélioration visuelle du comparateur"]
{"$rows_left_out":319}
{"sheet":"Strat 1","index":1,"n_rows":87,"n_cols":24,"rows_kept":87,"cut":false,"hidden":false,"merged":[[13,4,13,5],[49,20,49,21],[42,1,42,2],[11,6,12,6],[11,10,12,10],[11,14,12,14],[23,8,23,9],[23,11,23,13],[28,19,29,19],[17,14,17,15],[42,16,43,16],[27,1,28,6],[27,7,28,7],[34,1,34,2],[31,1,31,2],[40,1,40,2],[36,16,36,17],[44,1,44,2],[56,20,57,20],[63,16,63,19],[64,16,64,19],[41,1,41,2],[19,14,20,14],[21,11,21,13],[21,8,21,9],[27,15,28,17],[27,12,28,14],[2,23,2,24],[6,16,6,17],[4,16,4,17],[28,23,28,24],[0,0,1,1],[2,0,24,1],[2,4,2,7],[2,8,2,9],[2,13,2,15],[6,4,6,7],[6,8,6,9],[4,8,4,9],[4,14,4,15],[23,5,23,6],[21,5,21,6],[17,5,17,7],[4,2,4,4],[4,26,4,28],[4,29,4,31],[4,23,4,25],[6,12,6,13],[44,23,44,24],[42,23,43,24],[69,8,69,9],[69,10,69,11],[9,11,9,12],[9,15,9,16],[67,16,67,17],[67,13,67,14],[16,23,24,25],[27,8,28,10],[25,1,25,18],[38,1,38,2],[36,1,36,2],[30,1,30,2],[20,2,21,4],[19,17,20,17],[36,29,36,30],[38,23,38,24],[38,26,38,27],[38,29,38,30],[36,23,36,24],[36,26,36,27],[71,13,71,15],[49,1,49,2],[69,16,69,17],[70,13,70,14],[69,13,69,15],[67,1,67,2],[67,6,71,7],[67,8,67,9],[67,10,67,11],[69,1,69,2],[71,1,71,2],[71,4,71,5],[71,8,71,9],[71,10,71,11],[69,4,69,5]]}
[]
[]
["DONNEES COURSE",null,"Circuit / Piste :",null,null,null,null,null,"Longueur circuit :",null,{"$f":"VLOOKUP(E3,grille!K19:L102,2,FALSE)","v":{"$error":"#N/A"}},"corners :",{"$f":"VLOOKUP(E3,grille!K19:M102,3,FALSE)","v":{"$error":"#N/A"}},"Condition météo, horaire : ",null,null,null,"0h0",null,null,null,null,null,"Menus"]
[]
[null,null,"Catégorie du  véhicule : ",null,null,null,null,null,"Durée de la course :",null,"00:00:00","hr     où",0,{"$f":"K5+K68+K7","v":{"$error":"#DIV/0!"}},"Host salon : "]
[]
[null,null,"Modèle :",null,null,null,null,null,"Temps au tours : ",null,"00:00:40",null,null,null,null,"Cast : "]
[]
[]
[null,null,null,null,"condition usure",null,"pneus 1",null,null,null,"pneus 2",null,null,null,"pneus 3"]
{"$rows_left_out":78}
{"sheet":"Strat 2","index":2,"n_rows":87,"n_cols":24,"rows_kept":87,"cut":false,"hidden":false,"merged":[[27,8,28,10],[25,2,25,18],[44,23,44,24],[42,16,43,16],[42,23,43,24],[38,23,38,24],[30,1,30,2],[27,1,28,6],[27,7,28,7],[27,12,28,14],[31,1,31,2],[40,1,40,2],[41,1,41,2],[34,1,34,2],[42,1,42,2],[44,1,44,2],[56,20,57,20],[49,20,49,21],[71,1,71,2],[71,4,71,5],[71,8,71,9],[71,10,71,11],[69,4,69,5],[69,8,69,9],[69,10,69,11],[67,1,67,2],[67,6,71,7],[67,8,67,9],[67,10,67,11],[49,1,49,2],[69,1,69,2],[38,26,38,27],[38,29,38,30],[36,1,36,2],[36,23,36,24],[36,26,36,27],[36,29,36,30],[38,1,38,2],[36,16,36,17],[4,29,4,31],[6,4,6,7],[6,8,6,9],[6,13,6,14],[6,16,6,17],[4,2,4,4],[4,8,4,9],[4,26,4,28],[4,23,4,25],[0,0,1,1],[2,0,24,1],[2,4,2,7],[20,2,21,4],[21,5,21,6],[11,6,12,6],[13,4,13,5],[23,5,23,6],[17,5,17,7],[2,23,2,24],[4,14,4,15],[4,16,4,17],[17,14,17,15],[28,19,29,19],[2,13,2,15],[16,23,24,25],[19,14,20,14],[19,17,20,17],[9,15,9,16],[29,23,30,24],[9,11,9,12],[2,8,2,9],[27,15,28,17],[71,13,71,15],[63,16,63,19],[64,16,64,19],[67,16,67,17],[69,13,69,15],[69,16,69,17],[21,8,21,9],[21,11,21,13],[11,10,12,10],[11,14,12,14],[23,8,23,9],[23,11,23,13],[67,13,67,14]]}
[]
[]
["DONNEES COURSE",null,"Circuit / Piste :",null,{"$f":"'Strat 1'!E3:H3","v":0},null,null,null,"Longueur circuit :",null,{"$f":"'Strat 1'!K3","v":{"$error":"#N/A"}},"corners :",{"$f":"'Strat 1'!M3","v":{"$error":"#N/A"}},"Condition météo, horaire : ",null,null,{"$f":"'Strat 1'!Q3","v":0},{"$f":"'Strat 1'!R3","v":"0h0"},"hr",null,null,null,null,"Menus"]
[]
[null,null,"Catégorie du  véhicule : ",null,null,{"$f":"'Strat 1'!F5","v":0},null,null,"Durée de la course :",null,{"$f":"'Strat 1'!K5","v":"00:00:00"},"hr     où",{"$f":"'Strat 1'!M5","v":0},{"$f":"'Strat 1'!N5","v":{"$error":"#DIV/0!"}},"Host salon : ",null,{"$f":"'Strat 1'!Q5:R5","v":0}]
[]
[null,null,"Modèle :",null,{"$f":"'Strat 1'!E7:H7","v":0},null,null,null,null,null,null,null,null,null,null,"Cast : ",{"$f":"'Strat 1'!Q7:R7","v":0}]
[]
[]
[null,null,null,null,"condition usure",null,"pneus 1",null,null,null,"pneus 2",null,null,null,"pneus 3"]
{"$rows_left_out":78}
{"sheet":"strat 3","index":3,"n_rows":87,"n_cols":24,"rows_kept":87,"cut":false,"hidden":false,"merged":[[25,2,25,18],[27,8,28,10],[13,4,13,5],[69,1,69,2],[69,8,69,9],[69,10,69,11],[69,13,69,15],[67,1,67,2],[67,6,71,7],[67,8,67,9],[67,10,67,11],[71,1,71,2],[71,4,71,5],[71,8,71,9],[71,10,71,11],[69,4,69,5],[71,13,71,15],[67,13,67,14],[44,1,44,2],[49,1,49,2],[42,1,42,2],[40,1,40,2],[41,1,41,2],[44,23,44,24],[42,16,43,16],[49,20,49,21],[45,23,45,24],[46,23,46,24],[47,23,47,24],[48,23,48,24],[42,23,43,24],[56,20,57,20],[64,16,64,19],[67,16,67,17],[69,16,69,17],[63,16,63,19],[36,26,36,27],[36,29,36,30],[38,1,38,2],[38,23,38,24],[38,26,38,27],[38,29,38,30],[36,16,36,17],[4,26,4,28],[4,29,4,31],[6,4,6,7],[6,8,6,9],[6,13,6,14],[6,16,6,17],[4,2,4,4],[0,0,1,1],[2,0,24,1],[2,4,2,7],[2,8,2,9],[2,13,2,15],[17,5,17,7],[9,11,9,12],[9,15,9,16],[23,5,23,6],[19,14,20,14],[20,2,21,4],[21,5,21,6],[21,8,21,9],[11,6,12,6],[11,10,12,10],[11,14,12,14],[16,23,24,25],[17,14,17,15],[2,23,2,24],[4,8,4,9],[4,14,4,15],[4,16,4,17],[4,23,4,25],[21,11,21,13],[19,17,20,17],[23,8,23,9],[23,11,23,13],[29,23,30,24],[30,1,30,2],[34,1,34,2],[36,1,36,2],[36,23,36,24],[28,19,29,19],[27,1,28,6],[27,7,28,7],[27,15,28,17],[27,12,28,14],[31,1,31,2]]}
[]
[]
["DONNEES COURSE",null,"Circuit / Piste :",null,{"$f":"'Strat 1'!E3:H3","v":0},null,null,null,"Longueur circuit :",null,{"$f":"'Strat 1'!K3","v":{"$error":"#N/A"}},"corners :",{"$f":"'Strat 1'!M3","v":{"$error":"#N/A"}},"Condition météo, horaire : ",null,null,{"$f":"'Strat 1'!Q3","v":0},{"$f":"'Strat 1'!R3","v":"0h0"},"hr",null,null,null,null,"Menus"]
[]
[null,null,"Catégorie du  véhicule : ",null,null,{"$f":"'Strat 1'!F5","v":0},null,null,"Durée de la course :",null,{"$f":"'Strat 1'!K5","v":"00:00:00"},"hr     où",{"$f":"'Strat 1'!M5","v":0},{"$f":"'Strat 1'!N5","v":{"$error":"#DIV/0!"}},"Host salon : ",null,{"$f":"'Strat 1'!Q5:R5","v":0}]
[]
[null,null,"Modèle :",null,{"$f":"'Strat 1'!E7:H7","v":0},null,null,null,null,null,null,null,null,null,null,"Cast : ",{"$f":"'Strat 1'!Q7:R7","v":0}]
[]
[]
[null,null,null,null,"condition usure",null,"pneus 1",null,null,null,"pneus 2",null,null,null,"pneus 3"]
{"$rows_left_out":78}
{"sheet":"comparateur","index":4,"n_rows":87,"n_cols":37,"rows_kept":87,"cut":false,"hidden":false,"merged":[[7,2,46,2],[31,20,31,22],[3,2,3,3],[3,4,3,8],[3,16,3,22],[35,14,35,16],[21,14,21,16],[7,14,7,16],[11,4,12,4],[11,6,12,6],[11,8,12,8],[14,4,15,4],[14,6,15,6],[14,8,15,8],[28,11,29,12],[28,13,29,13],[28,14,29,16],[28,17,29,17],[37,14,37,16],[3,36,3,38],[7,11,7,12],[17,29,17,31],[17,20,17,22],[3,27,3,29],[3,31,3,32],[17,23,17,25],[11,13,12,13],[14,17,15,17],[14,13,15,13],[14,11,15,12],[11,27,12,27],[11,29,12,29],[49,23,49,29],[36,36,47,38],[27,36,28,37],[7,4,7,8],[45,14,45,16],[17,26,17,28],[23,14,23,16],[31,14,31,16],[35,11,35,12],[45,29,45,31],[31,29,31,31],[31,26,31,28],[45,26,45,28],[31,23,31,25],[45,20,45,22],[45,23,45,25],[11,31,12,31],[17,14,17,16],[11,14,12,16],[11,17,12,17],[14,14,15,16],[11,20,12,20],[11,21,12,21],[11,23,12,23],[11,25,12,25],[9,14,9,16],[11,11,12,12],[25,20,26,20],[25,21,26,21],[25,23,26,23],[21,11,21,12],[25,27,26,27],[25,29,26,29],[25,31,26,31],[25,11,26,12],[25,13,26,13],[25,14,26,16],[25,17,26,17],[25,25,26,25],[25,4,26,4],[25,6,26,6],[25,8,26,8],[28,4,29,4],[28,6,29,6],[28,8,29,8],[39,17,40,17],[39,14,40,16],[39,13,40,13],[39,11,40,12],[42,17,43,17],[42,14,43,16],[42,13,43,13],[42,11,43,12],[39,4,40,4],[39,6,40,6],[39,8,40,8],[42,4,43,4],[42,6,43,6],[42,8,43,8],[39,31,40,31],[39,20,40,20],[39,21,40,21],[39,23,40,23],[39,25,40,25],[39,27,40,27],[39,29,40,29]]}
[]
[]
[]
[null,null,"Circuit :",null,{"$f":"'Strat 1'!E3","v":0},null,null,null,null,null,null,{"$f":"'Strat 1'!N68","v":0},null,"Catégorie :",{"$f":"'Strat 1'!F5","v":0},"Voiture :",{"$f":"'Strat 1'!E7","v":0},null,null,null,null,null,null,null,null,null,null,{"$f":"'Strat 1'!Q3","v":0},null,null,null,{"$f":"'Strat 1'!R3","v":"0h0"},null,null,null,null,"Accès menus"]
[]
[]
[]
[null,null,"COMPARATEUR  STRAT",null,null,null,null,null,null,null,null,"Stratégie 1",null,null,"Indice de risque :",null,null,{"$f":"T69","v":0},null,null,"Type pneus :",{"$f":"'Strat 1'!E39","v":0},null,{"$f":"'Strat 1'!G39","v":0},null,{"$f":"'Strat 1'!I39","v":0},null,{"$f":"'Strat 1'!K39","v":0},null,{"$f":"'Strat 1'!M39","v":0},null,{"$f":"'Strat 1'!O39","v":0}]
[null,null,null,null,"type",null,"tps moyen",null,"durée",null,null,null,null,null,null,null,null,null,null,null,"Pit","Dép.",null,"P1",null,"P2",null,"P3",null,"P3",null,"P3"]
[null,null,null,null,{"$f":"'Strat 1'!I68","v":0},null,{"$f":"'Strat 1'!K68","v":{"$error":"#DIV/0!"}},null,{"$f":"'Strat 1'!G14","v":0},null,null,null,null,"STOP PIT","Durée : ",null,null,{"$f":"'Strat 1'!Q68","v":{"$error":"#N/A"}},{"$f":"R10*24","v":{"$error":"#N/A"}},null,"Nbr de tours :",{"$f":"'Strat 1'!F31","v":0},null,{"$f":"'Strat 1'!H31","v":0},null,{"$f":"'Strat 1'!J31","v":0},null,{"$f":"'Strat 1'!L31","v":0},null,{"$f":"'Strat 1'!N31","v":0},null,{"$f":"'Strat 1'!P31","v":0}]
{"$rows_left_out":78}
{"sheet":"chronos","index":5,"n_rows":96,"n_cols":34,"rows_kept":96,"cut":false,"hidden":false,"merged":[[12,1,15,1],[1,1,1,6],[21,2,21,4],[29,15,29,19],[28,6,28,8],[11,15,11,19],[9,14,10,22],[12,21,15,21],[13,19,15,19],[13,6,15,6],[13,7,15,7],[9,2,11,4],[25,11,25,14],[6,2,6,5],[13,18,15,18],[13,15,15,15],[30,21,33,21],[45,21,48,21],[46,15,48,15],[46,16,48,16],[46,17,48,17],[46,18,48,18],[46,19,48,19],[13,16,15,16],[13,17,15,17],[44,15,44,19],[4,2,4,5],[13,9,15,9],[13,10,15,10],[13,12,15,12],[13,13,15,13],[9,6,9,7],[9,9,9,10],[9,12,9,13],[13,4,15,4],[6,7,6,9],[4,8,4,9]]}
[]
[null,"Tableau des temps :"]
[]
[]
[null,null,"Equilibre des performances : ",null,null,null,null,null,"Météo circuit : ",null,{"$f":"'Strat 1'!Q3","v":0},null,{"$f":"'Strat 1'!R3","v":"0h0"}]
[]
[null,null,"Usure des pneumatiques : ",null,null,null,"X1","Consommation fuel : ",null,null,"X1","niv",100,{"$f":"'Strat 1'!Q18","v":100}]
[]
[]
[null,null,"Utilisation d'un même train de pneus    pour :",null,null,null,"Essais libres 1",null,null,"Essais libres 2",null,null,"Essais libre 3"]
{"$rows_left_out":87}
{"sheet":"nbr tours","index":6,"n_rows":208,"n_cols":15,"rows_kept":208,"cut":false,"hidden":false,"merged":[[3,14,3,15],[99,14,99,15],[199,14,199,15],[200,9,203,9],[100,9,103,9],[4,9,7,9],[101,11,103,11],[5,11,7,11],[201,3,203,3],[201,4,203,4],[201,5,203,5],[197,5,197,12],[201,6,203,6],[201,7,203,7],[201,11,203,11],[199,4,199,7],[1,5,1,12],[97,5,97,12],[101,3,103,3],[101,4,103,4],[101,5,103,5],[3,4,3,7],[99,4,99,7],[101,6,103,6],[101,7,103,7],[5,3,7,3],[5,4,7,4],[5,5,7,5],[5,6,7,6],[5,7,7,7]]}
[]
[null,null,"STRAT 1"]
[]
[null,null,null,null,"Nombre de tours par train de pneus",null,null,null,null,null,null,null,null,null,"menu"]
[]
[null,null,null,"Type de\npneus","Durée de vie\nou pic performance","Meilleur temps chrono","Moins bon temps","Temps moyen de réf. strat",null,null,null,"Ecart\nMT/MBT"]
[]
[]
[]
[null,null,null,{"$f":"chronos!$C$18","v":0},{"$f":"'Strat 1'!G14","v":0},{"$f":"chronos!E18","v":"00:00:00"},{"$f":"VLOOKUP('Strat 1'!G14,chronos!$AB$79:$AH$81,2,FALSE)","v":"00:00:00"},{"$f":"VLOOKUP('Strat 1'!G14,chronos!$AB$84:$AH$86,2,FALSE)","v":{"$error":"#DIV/0!"}},{"$f":"IFERROR(H10,0)","v":"00:00:00"},null,null,{"$f":"G10-F10","v":"00:00:00"}]
{"$rows_left_out":199}
{"sheet":"ajust éco","index":7,"n_rows":66,"n_cols":16,"rows_kept":66,"cut":false,"hidden":false,"merged":[[50,1,50,2],[3,15,4,15],[12,14,12,16],[5,1,6,1],[5,8,5,11],[30,1,30,7],[5,2,5,6],[1,2,3,11]]}
[]
[null,null,"Ajustements autonomie et temps conduite éco"]
[]
[null,null,null,null,null,null,null,null,null,null,null,null,null,null,null,"Menu"]
[]
[null,"Réglages\nconduite éco","Gain autonomie",null,null,null,null,null,"Dégradation temps"]
[null,null,"Coeff.",{"$f":"'Strat 1'!M18","v":{"$error":"#N/A"}},{"$f":"'Strat 1'!I18*'Strat 1'!K3","v":{"$error":"#N/A"}},"Gain nbr tours","L/100","réservoir","Sec/Km","pas à pas","Sec/Km","Sec/tour"]
[]
[null,0,0,{"$f":"(1*G9)/$E$7","v":{"$error":"#N/A"}},"écart conso",0,{"$f":"'Strat 1'!K18","v":100},100,0,0,0,0]
[null,"tr/mn 2/3",4,{"$f":"(1*G10)/$E$7","v":{"$error":"#N/A"}},{"$f":"C10+$B$65","v":4},{"$f":"(H10*$A$11)/$H$9-$A$11","v":0},{"$f":"$G$9-E10","v":96},{"$f":"$H$9+E10","v":104},{"$f":"J10+($B$66/50)","v":0.01},{"$f":"K10","v":0.01},0.01,{"$f":"I10*$D$46","v":{"$error":"#N/A"}}]
{"$rows_left_out":57}
{"sheet":"circuits","index":8,"n_rows":263,"n_cols":10,"rows_kept":263,"cut":false,"hidden":false,"merged":[]}
[]
[null,null,null,null,null,null,null,null,"29 circuits, 85 pistes"]
[null,null,null,null,null,null,null,null,"Circuits - Pistes","Long (km)"]
[null,null,null,null,null,null,null,null,"Alsace - Village",{"$f":"grille!L19","v":5.423}]
[null,null,null,null,null,null,null,null,"Alsace - Village II",{"$f":"grille!L20","v":5.423}]
[]
[]
[]
[]
[]
{"$rows_left_out":254}
{"sheet":"voitures","index":9,"n_rows":345,"n_cols":5,"rows_kept":345,"cut":false,"hidden":false,"merged":[]}
[]
[]
[]
[]
[]
[]
["N°","Catégories","Marques","Modèles"]
[1,"N 300","Ford","FOCUS ST 2015"]
[2,"N 400","Ford","MUSTANG GT PREMIUM FASTBACK 2015"]
[3,"Gr.4","Ford","MUSTANG GR.4"]
{"$rows_left_out":336}
{"sheet":"Transmissions","index":10,"n_rows":42,"n_cols":14,"rows_kept":42,"cut":false,"hidden":false,"merged":[[34,1,35,8],[36,1,37,2],[36,5,37,6],[36,9,37,10],[36,13,44,18],[38,11,40,12],[44,11,44,12],[46,11,46,12],[41,11,41,12],[42,11,42,12],[43,11,43,12],[5,13,7,18],[8,13,13,18],[14,13,18,18],[20,1,21,8],[22,1,23,2],[22,13,27,18],[24,7,25,8],[24,11,25,12],[26,7,32,8],[26,11,32,12],[16,1,16,2],[17,1,17,2],[16,5,16,6],[16,9,16,10],[1,1,1,12],[3,1,4,8],[5,1,6,2],[5,5,6,6],[5,9,6,10]]}
[]
[null,"Les différents types de transmission "]
[]
[null,"  PROPULSION"]
[]
[null,"RR",null,null,null,"FR",null,null,null,"MR",null,null,null,"RR : Très rares dans GTS, ces voitures ont à la fois un moteur et des roues motrices à l'arrière. Leur conduite n'est pas des plus évidentes et demande un temps d'adaptation."]
[]
[]
[null,null,null,null,null,null,null,null,null,null,null,null,null,"FR : Le moteur de ces voitures, appelées des propulsions, est situé à l'avant et ce sont les roues de derrière qui sont motrices.\nCes voitures ont généralement une très bonne accélération et une vitesse de pointe très élevée…"]
[]
{"$rows_left_out":33}
{"sheet":"grille","index":11,"n_rows":102,"n_cols":14,"rows_kept":102,"cut":false,"hidden":false,"merged":[]}
[]
[]
["nbrtours","pneu","pneu1","usure","conso","météo","fuel","éco2","pneu2","frein",null,null,null,"pneu3"]
[{"$f":"chronos!G12","v":0},"S soft","S soft","X1","X1","beau temps",0,0,"libre",5,null,null,null,{"$f":"'Strat 1'!G11","v":0}]
[{"$f":"chronos!J12","v":0},"soft","soft","X2","X2","ensoleillé",0.5,"tr/mn 2/3","obligatoire",4,null,null,null,{"$f":"'Strat 1'!K11","v":0}]
[{"$f":"chronos!M12","v":0},"médium","médium","X3","X3","nuageux",1,"tr/mn 1/2",null,3,null,null,null,{"$f":"'Strat 1'!O11","v":0}]
[null,"hard","hard","X4","X4","tombé nuit",1.5,"tr/mn 1/3",null,2]
[null,"sans","inter","X5","X5","nuit",2,2,null,1]
[null,"inter","pluie","X6","X6","levé du jour",3,3,null,0]
[null,"pluie",null,"X7","X7","humide",4,4,null,-1]
{"$rows_left_out":93}
{"sheet":"grille2","index":12,"n_rows":371,"n_cols":5,"rows_kept":371,"cut":false,"hidden":false,"merged":[]}
[]
[]
[]
[null,"catégories",null,"Voitures"]
[null,"GR1_",null,"GR1"]
[null,"GR2_",null,"Alpine VGT 2017"]
[null,"GR3_",null,"Audi Audi VGT"]
[null,"GR4_",null,"Audi R18 (Audi Sport Team Joest) '16"]
[null,"GRB",null,"Audi R18 TDI (Audi Sport Team Joest) '11"]
[null,"GRX",null,"Audi R18 TDI (Le Mans 2011)"]
{"$rows_left_out":362}
{"sheet":"PIT","index":13,"n_rows":26,"n_cols":33,"rows_kept":26,"cut":false,"hidden":false,"merged":[[14,16,14,17],[3,12,4,14],[24,12,24,14],[22,12,22,14],[20,12,20,14],[12,16,12,17],[16,16,16,17],[10,32,10,33],[6,16,6,17],[8,19,8,20],[3,16,4,18],[6,19,6,22],[8,16,8,17],[10,16,10,17]]}
[]
[null,null,"Aide au calcul des temps d'arrêts réels aux stands :"]
[]
[null,null,null,null,null,null,null,null,null,null,null,null,"Modifier les temps",null,null,null,"Détail des temps d'arrêt et de ravitaillement"]
[]
[]
[null,null,null,null,null,null,null,null,null,null,null,null,"t3",30,null,null,"Temps démontes et montes des pneus : ",null,4.5," (ce temps ne varie pas sur GT)"]
[]
[null,null,null,null,null,null,null,null,null,null,null,null,null,null,null,null,"Temps réel changement pneus = (t2 - t1)",null,{"$f":"N11-N17","v":5.6},"(temps sec)",null,null,null,null,null,null,null,null,null,null,null,{"$f":"S9+S11","v":23}]
[]
{"$rows_left_out":16}